Hi Folks

I have done a few installations according to this help:


Until a now I can''t get it to work anymore, when I try to make cal++ :

svn co https://calpp.svn.sourceforge.net/svnroot/calpp calpp
cd calpp/trunk
cmake .
make install

I get this error:

root:abt:~/calpp/trunk# cmake .
-- ATI CAL cl library directory /usr/lib
-- ATI CAL rt library directory /usr/lib
-- Boost version 1_40
-- Configuring done
-- Generating done
-- Build files have been written to: /root/calpp/trunk
rootiab t: -/calpp/trunk# make
I 6%] Building CXX object examples/CMakeFiles/coalescingtest.dir/coalescingtest
In file included from /root/calpp/trunk/examples/coalescingtest.cpp:27: -
/root/calpp/trunk/include/cal/cal.hpp:442: error: 'mutex' in naiaespace 'boost' d
oes not name a type
/root/calpp/trunk/include/cal/cal.hpp:483: error: expected constructor, destruct
or, or type conversion before 'CALcontextJielper'
/root/calpp/trunk/include/cal/cal.hpp:750: error: 'recursivejwtex' in nanespace
'boost' does not name a type
make[2]: *** [examples/CMakeFiles/coalescingtest.dir/coalescingtest.cpp.o] Error
make(l]: *** [exainples/CMakeFlles/coalescingtest.dir/all] Error 2
make: *** [all] Error 2

I did 3 fresh BT 5 r2 and r3 (x64) installations but still stuck on above, cantt find a understandable solution by google or forum.
I tried with and without apt-get upgrade
all the lib are installed succefully ( based on the output)
it is a hd5970 card

thanks in advance