it says BT5 R1 already includes several injection patches. so does that mean: channel-negative-one-maxim.patch

mac80211_2.6.32.2-wl_frag+ack_radiotap.patch

are included?

injection mode stopped working when i upgraded to BT5 R1. when i compiled compact wireless i get this error :

Code:
In file included from /root/compat-wireless-3.1-rc1-1/net/mac80211/ieee80211_i.h:27,
                 from /root/compat-wireless-3.1-rc1-1/net/mac80211/main.c:27:
/root/compat-wireless-3.1-rc1-1/include/net/ieee80211_radiotap.h:295: error: expected ‘=’, ‘,’, ‘;’, ‘asm’ or ‘__attribute__’ before ‘-’ token
In file included from /root/compat-wireless-3.1-rc1-1/net/mac80211/ieee80211_i.h:27,
                 from /root/compat-wireless-3.1-rc1-1/net/mac80211/main.c:27:
/root/compat-wireless-3.1-rc1-1/include/net/ieee80211_radiotap.h:295:17: error: too many decimal points in number
/root/compat-wireless-3.1-rc1-1/include/net/ieee80211_radiotap.h:295:65: error: too many decimal points in number
/root/compat-wireless-3.1-rc1-1/include/net/ieee80211_radiotap.h:296:11: error: too many decimal points in number
/root/compat-wireless-3.1-rc1-1/include/net/ieee80211_radiotap.h:296:84: error: invalid digit "8" in octal constant
/root/compat-wireless-3.1-rc1-1/include/net/ieee80211_radiotap.h:297:11: error: too many decimal points in number
/root/compat-wireless-3.1-rc1-1/include/net/ieee80211_radiotap.h:297:96: error: invalid digit "8" in octal constant
/root/compat-wireless-3.1-rc1-1/include/net/ieee80211_radiotap.h:298: error: stray ‘@’ in program
/root/compat-wireless-3.1-rc1-1/include/net/ieee80211_radiotap.h:298: error: stray ‘@’ in program
/root/compat-wireless-3.1-rc1-1/include/net/ieee80211_radiotap.h:298: error: stray ‘@’ in program
/root/compat-wireless-3.1-rc1-1/include/net/ieee80211_radiotap.h:298: error: stray ‘@’ in program
/root/compat-wireless-3.1-rc1-1/include/net/ieee80211_radiotap.h:302: error: stray ‘#’ in program
/root/compat-wireless-3.1-rc1-1/include/net/ieee80211_radiotap.h:303: error: stray ‘#’ in program
/root/compat-wireless-3.1-rc1-1/include/net/ieee80211_radiotap.h:319:3: warning: "/*" within comment
/root/compat-wireless-3.1-rc1-1/include/net/ieee80211_radiotap.h:333:4: warning: "/*" within comment
/root/compat-wireless-3.1-rc1-1/include/net/ieee80211_radiotap.h:339: error: expected identifier or ‘(’ before ‘+’ token
/root/compat-wireless-3.1-rc1-1/include/net/ieee80211_radiotap.h:343: error: expected identifier or ‘(’ before ‘if’
/root/compat-wireless-3.1-rc1-1/include/net/ieee80211_radiotap.h:344: error: stray ‘@’ in program
/root/compat-wireless-3.1-rc1-1/include/net/ieee80211_radiotap.h:344: error: stray ‘@’ in program
/root/compat-wireless-3.1-rc1-1/include/net/ieee80211_radiotap.h:344: error: stray ‘@’ in program
/root/compat-wireless-3.1-rc1-1/include/net/ieee80211_radiotap.h:344: error: stray ‘@’ in program
/root/compat-wireless-3.1-rc1-1/include/net/ieee80211_radiotap.h:348: error: expected identifier or ‘(’ before ‘-’ token
/root/compat-wireless-3.1-rc1-1/include/net/ieee80211_radiotap.h:352: error: expected identifier or ‘(’ before ‘else’
/root/compat-wireless-3.1-rc1-1/include/net/ieee80211_radiotap.h:361: error: expected identifier or ‘(’ before ‘if’
make[3]: *** [/root/compat-wireless-3.1-rc1-1/net/mac80211/main.o] Error 1
make[2]: *** [/root/compat-wireless-3.1-rc1-1/net/mac80211] Error 2
make[1]: *** [_module_/root/compat-wireless-3.1-rc1-1] Error 2
make[1]: Leaving directory `/usr/src/linux-source-2.6.39.4'
make: *** [modules] Error 2