Results 1 to 5 of 5

Thread: wusb600n

  1. #1
    Member
    Join Date
    Jan 2007
    Posts
    117

    Default wusb600n

    i see on the backtrack wiki (HCL:Wireless - Offensive-security.com) that it is supported but the download link for the driver is invalid now. just takes me to a german site with no download link that i can see. straight off the install of bt4 pre final, it seems like my wireless card works, as far as monitoring packets. but, injection doesn't seem to work. i cant authenticate and replay attacks go 1 arp request every few minutes. so anyway, is there any way to test if my card does indeed not support injection, or if its something with my router? ive cracked it many times with my old wireless card, but i lost it and got a new one, a wusb600n. i didn't really plan it out, my friend was selling it for $20 so i bought it.

    thanks in advance

    edit:
    i did an aireplay test and it shows 0% success but it doesnt say failed...

    root@adam-desktop:~# aireplay-ng -9 -e dd-wrt -a 00:11:50:31:1F8 ra0
    18:54:23 Waiting for beacon frame (BSSID: 00:11:50:31:1F8) on channel 1
    18:54:23 Trying broadcast probe requests...
    18:54:25 No Answer...
    18:54:25 Found 1 AP

    18:54:25 Trying directed probe requests...
    18:54:25 00:11:50:31:1F8 - channel: 1 - 'dd-wrt'
    18:54:33 0/30: 0%

  2. #2
    Super Moderator Archangel-Amael's Avatar
    Join Date
    Jan 2010
    Location
    Somewhere
    Posts
    8,012

    Default

    Quote Originally Posted by ats1080 View Post
    i. just takes me to a german site with no download link that i can see.
    Link SpeedShare - Download rt2870-kernel-2.6.24-nemesis.tar.bz2
    worked just fine for me and it was in English too. Look also for the Union Jack in the upper right hand corner to change to English.
    so anyway, is there any way to test if my card does indeed not support injection, or if its something with my router?
    Google = injection test commands.
    That works too.
    To be successful here you should read all of the following.
    ForumRules
    ForumFAQ
    If you are new to Back|Track
    Back|Track Wiki
    Failure to do so will probably get your threads deleted or worse.

  3. #3
    Member
    Join Date
    Jan 2007
    Posts
    117

    Default

    Quote Originally Posted by archangel.amael View Post
    Link SpeedShare - Download rt2870-kernel-2.6.24-nemesis.tar.bz2
    worked just fine for me and it was in English too. Look also for the Union Jack in the upper right hand corner to change to English.

    Google = injection test commands.
    That works too.
    well...i dont know wtf a union jack is, but i did find the britan flag. and that would explain it...apparently it was saying this in german:

    Sorry, only with a free Collector account or a Premium account you are allowed to use proxies!

    i suppose ill have to turn off my proxy and try again.

    if im getting a 0% in the aireplay test is it safe to say that it failed to inject?

  4. #4
    Super Moderator Archangel-Amael's Avatar
    Join Date
    Jan 2010
    Location
    Somewhere
    Posts
    8,012

    Default

    Quote Originally Posted by ats1080 View Post
    well...i dont know wtf a union jack is, but i did find the britan flag. and that would explain it...apparently it was saying this in german:Sorry, only with a free Collector account or a Premium account you are allowed to use proxies!
    i suppose ill have to turn off my proxy and try again.
    if im getting a 0% in the aireplay test is it safe to say that it failed to inject?
    Google = Union Jack
    Injection test
    To be successful here you should read all of the following.
    ForumRules
    ForumFAQ
    If you are new to Back|Track
    Back|Track Wiki
    Failure to do so will probably get your threads deleted or worse.

  5. #5
    Member
    Join Date
    Jan 2007
    Posts
    117

    Default

    ok so i got that downloaded, but im getting compile errors

    Code:
    root@adam-desktop:~/b/rt2870-kernel-2.6.24-nemesis# make
    make -C tools
    make[1]: Entering directory `/root/b/rt2870-kernel-2.6.24-nemesis/tools'
    gcc -g bin2h.c -o bin2h
    make[1]: Leaving directory `/root/b/rt2870-kernel-2.6.24-nemesis/tools'
    /root/b/rt2870-kernel-2.6.24-nemesis/tools/bin2h
    cp -f os/linux/Makefile.6 /root/b/rt2870-kernel-2.6.24-nemesis/os/linux/Makefile
    make  -C  /lib/modules/2.6.29.4/build SUBDIRS=/root/b/rt2870-kernel-2.6.24-nemesis/os/linux modules
    make[1]: Entering directory `/usr/src/linux-source-2.6.29.4'
    
      WARNING: Symbol version dump /usr/src/linux-source-2.6.29.4/Module.symvers
               is missing; modules will have no dependencies and modversions.
    
      CC [M]  /root/b/rt2870-kernel-2.6.24-nemesis/os/linux/../../common/md5.o
      CC [M]  /root/b/rt2870-kernel-2.6.24-nemesis/os/linux/../../common/mlme.o
      CC [M]  /root/b/rt2870-kernel-2.6.24-nemesis/os/linux/../../common/rtmp_wep.o
      CC [M]  /root/b/rt2870-kernel-2.6.24-nemesis/os/linux/../../common/action.o
      CC [M]  /root/b/rt2870-kernel-2.6.24-nemesis/os/linux/../../common/ba_action.o
      CC [M]  /root/b/rt2870-kernel-2.6.24-nemesis/os/linux/../../common/cmm_data.o
      CC [M]  /root/b/rt2870-kernel-2.6.24-nemesis/os/linux/../../common/rtmp_init.o
      CC [M]  /root/b/rt2870-kernel-2.6.24-nemesis/os/linux/../../common/rtmp_tkip.o
      CC [M]  /root/b/rt2870-kernel-2.6.24-nemesis/os/linux/../../common/cmm_sync.o
      CC [M]  /root/b/rt2870-kernel-2.6.24-nemesis/os/linux/../../common/eeprom.o
      CC [M]  /root/b/rt2870-kernel-2.6.24-nemesis/os/linux/../../common/cmm_sanity.o
      CC [M]  /root/b/rt2870-kernel-2.6.24-nemesis/os/linux/../../common/cmm_info.o
      CC [M]  /root/b/rt2870-kernel-2.6.24-nemesis/os/linux/../../common/cmm_wpa.o
      CC [M]  /root/b/rt2870-kernel-2.6.24-nemesis/os/linux/../../common/dfs.o
      CC [M]  /root/b/rt2870-kernel-2.6.24-nemesis/os/linux/../../sta/assoc.o
      CC [M]  /root/b/rt2870-kernel-2.6.24-nemesis/os/linux/../../sta/aironet.o
      CC [M]  /root/b/rt2870-kernel-2.6.24-nemesis/os/linux/../../sta/auth.o
      CC [M]  /root/b/rt2870-kernel-2.6.24-nemesis/os/linux/../../sta/auth_rsp.o
      CC [M]  /root/b/rt2870-kernel-2.6.24-nemesis/os/linux/../../sta/sync.o
      CC [M]  /root/b/rt2870-kernel-2.6.24-nemesis/os/linux/../../sta/sanity.o
      CC [M]  /root/b/rt2870-kernel-2.6.24-nemesis/os/linux/../../sta/rtmp_data.o
      CC [M]  /root/b/rt2870-kernel-2.6.24-nemesis/os/linux/../../sta/connect.o
      CC [M]  /root/b/rt2870-kernel-2.6.24-nemesis/os/linux/../../sta/wpa.o
      CC [M]  /root/b/rt2870-kernel-2.6.24-nemesis/os/linux/../../os/linux/rt_linux.o
      CC [M]  /root/b/rt2870-kernel-2.6.24-nemesis/os/linux/../../os/linux/rt_profile.o
    /root/b/rt2870-kernel-2.6.24-nemesis/os/linux/../../os/linux/rt_profile.c: In function ‘RTMPReadParametersHook’:
    /root/b/rt2870-kernel-2.6.24-nemesis/os/linux/../../os/linux/rt_profile.c:778: error: ‘struct task_struct’ has no member named ‘fsuid’
    /root/b/rt2870-kernel-2.6.24-nemesis/os/linux/../../os/linux/rt_profile.c:779: error: ‘struct task_struct’ has no member named ‘fsgid’
    /root/b/rt2870-kernel-2.6.24-nemesis/os/linux/../../os/linux/rt_profile.c:780: error: ‘struct task_struct’ has no member named ‘fsuid’
    /root/b/rt2870-kernel-2.6.24-nemesis/os/linux/../../os/linux/rt_profile.c:780: error: ‘struct task_struct’ has no member named ‘fsgid’
    /root/b/rt2870-kernel-2.6.24-nemesis/os/linux/../../os/linux/rt_profile.c:1369: error: ‘struct task_struct’ has no member named ‘fsuid’
    /root/b/rt2870-kernel-2.6.24-nemesis/os/linux/../../os/linux/rt_profile.c:1370: error: ‘struct task_struct’ has no member named ‘fsgid’
    make[2]: *** [/root/b/rt2870-kernel-2.6.24-nemesis/os/linux/../../os/linux/rt_profile.o] Error 1
    make[1]: *** [_module_/root/b/rt2870-kernel-2.6.24-nemesis/os/linux] Error 2
    make[1]: Leaving directory `/usr/src/linux-source-2.6.29.4'
    make: *** [LINUX] Error 2
    well thats odd. i redownloaded the bt4 beta instead of pre final and installed the drivers and its working fine with those drivers. id like to know what that complie error is, i like bt4 pre-final.

    Code:
    root@bt:~# aireplay-ng -9 -e dd-wrt -a 00:11:50:31:1F:D8 ra0
    For information, no action required: Using gettimeofday() instead of /dev/rtc
    23:21:14  Waiting for beacon frame (BSSID: 00:11:50:31:1F:D8) on channel 1
    23:21:14  Trying broadcast probe requests...
    23:21:16  No Answer...
    23:21:16  Found 1 AP
    
    23:21:16  Trying directed probe requests...
    23:21:16  00:11:50:31:1F:D8 - channel: 1 - 'dd-wrt'
    23:21:17  Ping (min/avg/max): 6.371ms/17.165ms/37.605ms Power: -60.21
    23:21:17  29/30:  96%
    
    23:21:17  Injection is working!
    halp anyone?

Posting Permissions

  • You may not post new threads
  • You may not post replies
  • You may not post attachments
  • You may not edit your posts
  •